{"text_format":"1","workbook":"xlsx","n_sheets":10,"sheets":["Calculator","Check","Input","Please read","Output","Single Life","Limited Pay","Joint Life Factors","Modal Factors","Surrender Factors"],"not_rendered":{"charts":0,"images":1,"macros":1,"external_links":0,"defined_names":24,"comments":4,"pivot_tables":0},"unopened":[],"bounds":{"document_bytes":16777216,"sheet_cells":100000,"rows_first":2000,"rows_last":500,"rows_between":2000,"halvings":0,"cell_chars":16384,"cell_head_chars":4096},"cells_cut":0,"cells_raw":0,"read":"whole","date_system":"1900"}

{"sheet":"Calculator","index":0,"n_rows":48,"n_cols":18,"rows_kept":48,"cut":false,"hidden":false,"merged":[[39,18,39,19],[33,16,33,17],[34,12,34,13],[34,14,34,15],[34,16,34,17],[38,18,38,19],[37,18,37,19],[33,14,33,15],[35,14,35,15],[36,12,36,13],[36,16,36,17],[35,16,35,17],[13,4,13,5],[15,4,15,5],[40,12,40,13],[40,14,40,15],[36,14,36,15],[34,1,34,7],[20,4,20,5],[31,1,31,2],[22,4,22,5],[31,3,31,4],[33,12,33,13],[17,4,17,5],[21,4,21,5],[18,4,18,5],[19,4,19,5],[27,3,27,4],[1,1,1,7],[2,1,2,7],[3,1,3,7],[4,1,4,7],[12,4,12,5],[26,16,26,17],[27,16,27,17],[26,12,26,13],[28,18,28,19],[26,14,26,15],[26,18,26,19],[27,12,27,13],[27,14,27,15],[27,18,27,19],[26,1,26,2],[30,1,30,4],[25,1,25,4],[26,5,26,6],[27,5,27,6],[23,4,23,5],[26,3,26,4],[36,1,36,4],[40,16,40,17],[41,16,41,17],[31,5,31,6],[37,1,37,2],[37,3,37,4],[35,12,35,13],[37,5,37,6],[41,12,41,13],[41,14,41,15],[32,12,32,15],[39,12,39,15],[25,12,25,15],[27,1,27,2]]}
[]
[null," Aditya Birla Sun Life Insurance"]
[null,"   ABSLI Guaranteed Annuity Plus"]
[]
[null,"Your Policy Illustration"]
[]
{"$rows_left_out":43}
{"sheet":"Check","index":1,"n_rows":75,"n_cols":64,"rows_kept":75,"cut":false,"hidden":true,"merged":[[16,0,16,1],[1,19,1,20],[1,22,1,23],[1,27,1,28],[1,0,1,1]]}
[]
["Input Parameters",null,null,null,null,null,null,null,null,null,null,"Min","Max","ERR","CODE",{"$f":"IF(SUM(N3:N10)=0,0,VLOOKUP(1,N3:O10,2,0))","v":0},{"$f":"IF(P2=0,\"BSLI Immediate Annuity Plan\",OFFSET(P2,P2,1))","v":"BSLI Immediate Annuity Plan"},null,null,"Annuity Option",null,null,"Annuity Pay Mode",null,"Factor",null,null,"Requirement",null,null,null,"Annuity Options",null,"Annuity Option",null,"Increasing/Level","Increasing %","Annuity Certain","ROP%","PPT","Deferment years",null,"Rate 1",null,null,"Rate 2",null,"Joint Life factor","Annuity 1","Annnuity 2","Modal Annuity Payable","Premium Payable 1","Premium Payable 2","Final Premium Payable","Minimum premium 1","Minimum premium 2","Minimum premium payable","Minimum Annuity Amount","Minimum entry age for primary annuitant is 0","Maximum entry age for primary annuitant is 90",{"$f":"Q7","v":"Please enter a minimum Annuity of  Rs. 12000"},{"$f":"Q8","v":"Please input minimum premium of  Rs. 159066 (to fulfil minimum annuity amount requirement)"},"Please select a lower Deferment period."]
["Age - Annuitant 1",{"$f":"Calculator!D8","v":60},null,null,null,null,null,null,null,null,null,{"$f":"IF(Output!G14=\"QROPs\",55,IF(Input!G11=\"Yes\",45,IF(Annuity_Option<>6,0,45)))","v":0},{"$f":"IF(AND(Input!G11=\"No\",Annuity_Option=5),100,IF(OR(Annuity_Option=6,Annuity_Option=7),65,IF(Annuity_Option=9,75,90)))","v":90},{"$f":"IF(ISERROR(O3),0,IF(O3=0,0,1))","v":0},{"$f":"IF($B$3<$L$3,1,IF($B$3>$M$3,2,0))","v":0},1,{"$f":"IF(Output!G14=\"QROPs\",\"Minimum entry age for QROPs is \"&L3,\"Minimum entry age for primary annuitant is \"&L3)","v":"Minimum entry age for primary annuitant is 0"},null,null,"Option 1 - Life Annuity",1,null,"Annual",1,1,1,12000,"Annuity",2,null,1,"Option 1 - Life Annuity",null,1,"Option 1 - Life Annuity","Level",null,null,null,1,null,1,"'Single Life'!$B$9:$E$110",null,4,"'Single Life'!$B$116:$E$217",null,{"$f":"IF($B$12=0,0,VLOOKUP(Age_1,'Joint Life Factors'!$A$9:$L$12,4,TRUE))","v":-0.09},{"$f":"IF(JointLife_Ind=0,VLOOKUP(IF(AND(Gender=2,Annuity_Option<>6,Annuity_Option<>7),MAX(Age_1-3,0),Age_1),IF(AND(Gender=2,OR(Annuity_Option=6,Annuity_Option=7)),INDIRECT($AR3),INDIRECT($AQ3)),$AS3,0),VLOOKUP(IF(Age_1=Age_2,IF(OR(Gender=2,$B$6=2),MAX(Age_1-3,0),Age_1),IF(Age_1<Age_2,IF(Gender=2,MAX(Age_1-3,0),Age_1),IF($B$6=2,MAX(Age_2-3,0),Age_2))),INDIRECT($AQ3),$AS3,0))","v":8088},{"$f":"IF(JointLife_Ind=0,VLOOKUP(IF(AND(Gender=2,Annuity_Option<>6,Annuity_Option<>7),MAX(Age_1-3,0),Age_1),IF(AND(Gender=2,OR(Annuity_Option=6,Annuity_Option=7)),INDIRECT($AU3),INDIRECT($AT3)),$AS3,0),VLOOKUP(IF(Age_1=Age_2,IF(OR(Gender=2,$B$6=2),MAX(Age_1-3,0),Age_1),IF(Age_1<Age_2,IF(Gender=2,MAX(Age_1-3,0),Age_1),IF($B$6=2,MAX(Age_2-3,0),Age_2))),INDIRECT($AT3),$AS3,0))","v":8415},{"$f":"IF(Request=2,Annuity_Input,((AW3*MIN(200000,Premium_Input)/100000)+AX3*IF(Premium_Input>200000,(Premium_Input-200000)/100000,0))*IF(JointLife_Ind=1,(1+AV3),1)*(VLOOKUP(Payout_Mode,'Modal Factors'!$C$4:$D$7,2,0))*IF(OR(Input!$D$22=\"Yes\",Input!$D$23=\"Yes\"),Bonus_SP,1)/VLOOKUP(Payout_Mode,$X$3:$Z$6,3,0))","v":391844.54399999994},{"$f":"IF(Request=1,Premium_Input,((((AY3*VLOOKUP(Payout_Mode,$X$3:$Z$6,3,0))/(VLOOKUP(Payout_Mode,'Modal Factors'!$C$4:$D$7,2,0))/(IF(OR(Input!$D$22=\"Yes\",Input!$D$23=\"Yes\"),Bonus_SP,1)))/IF(JointLife_Ind=0,1,(1+$AV3)))-(200000*AW3)/100000)/(AX3/100000)+200000)","v":5000000},{"$f":"IF(Request=1,Premium_Input,((((AY3*VLOOKUP(Payout_Mode,$X$3:$Z$6,3,0))/(VLOOKUP(Payout_Mode,'Modal Factors'!$C$4:$D$7,2,0))/(IF(OR(Input!$D$22=\"Yes\",Input!$D$23=\"Yes\"),Bonus_SP,1)))/IF(JointLife_Ind=0,1,(1+$AV3)))/(AW3/100000)))","v":5000000},{"$f":"IF(AZ3>200000,AZ3,BA3)","v":5000000},{"$f":"(((($L$14*VLOOKUP(Payout_Mode,$X$3:$Z$6,3,0))/(VLOOKUP(Payout_Mode,'Modal Factors'!$C$4:$D$7,2,0))/(IF(OR(Input!$D$22=\"Yes\",Input!$D$23=\"Yes\"),Bonus_SP,1)))/IF(JointLife_Ind=0,1,(1+AV3)))-(200000*AW3)/100000)/(AX3/100000)+200000","v":160655.77655247669},{"$f":"(((($L$14*VLOOKUP(Payout_Mode,$X$3:$Z$6,3,0))/(VLOOKUP(Payout_Mode,'Modal Factors'!$C$4:$D$7,2,0))/(IF(OR(Input!$D$22=\"Yes\",Input!$D$23=\"Yes\"),Bonus_SP,1)))/IF(JointLife_Ind=0,1,(1+AV3)))/(AW3/100000))","v":159065.07909113396},{"$f":"MAX(150000,0,IF(BC3>200000,BC3,BD3))","v":159065.07909113396},{"$f":"MAX((AW3*150000/100000)*IF(JointLife_Ind=1,(1+AV3),1)*(VLOOKUP(Payout_Mode,'Modal Factors'!$C$4:$D$7,2,0))*IF(OR(Input!$D$22=\"Yes\",Input!$D$23=\"Yes\"),Bonus_SP,1)/VLOOKUP(Payout_Mode,$X$3:$Z$6,3,0), IF(Payout_Mode=1,12000,IF(Payout_Mode=2,6000,IF(Payout_Mode=3,3000,1000))))","v":12000},null,{"$f":"IF(OR(Age_1>90,AND(Calculator!$E$22=\"Joint Life\", Age_2>90)),\"Maximum entry age is 90 years\",\"\")","v":""},{"$f":"IF(Request=2, IF(Annuity_Input<Check!BF3,\"Minimum Annuity amount should be \"&ROUNDUP(BF3,0),\"\"),\"\")","v":""},{"$f":"IF(Request=1,IF($B$10<BE3,\"Minimum premium should be Rs. \"&ROUNDUP(BE3,0),IF(AND($B$10<100000,$AH3=9,OR($AN3=8,$AN3=9,$AN3=10)),\"Minimum premium should be Rs. 1,00,000\",\"\")),\"\")","v":""},{"$f":"IF(AND(OR($AN3=8,$AN3=9),AO3>10),\"Deferment Period not allowed\",IF(AND($AN3=10,AO3>11),\"Deferment Period not allowed\",\"\"))","v":""}]
["Age - Annuitant 2",{"$f":"IF(OR(Annuity_Option=4,Annuity_Option=8),Calculator!D9,IF(AND(OR(Annuity_Option=1,Annuity_Option=5,Annuity_Option=9,Annuity_Option=10),Input!D16=\"Joint Life\"),Calculator!D9,\"NA\"))","v":60},{"$f":"IF(OR(C7=4,C7=8),Calculator!$D$9,IF(AND(OR(C7=1,C7=5,C7=9,C7=10),Input!$D$16=\"Joint Life\"),Calculator!$D$9,\"NA\"))","v":"NA"},{"$f":"IF(OR(D7=4,D7=8),Calculator!$D$9,IF(AND(OR(D7=1,D7=5,D7=9,D7=10),Input!$D$16=\"Joint Life\"),Calculator!$D$9,\"NA\"))","v":"NA"},{"$f":"IF(OR(E7=4,E7=8),Calculator!$D$9,IF(AND(OR(E7=1,E7=5,E7=9,E7=10),Input!$D$16=\"Joint Life\"),Calculator!$D$9,\"NA\"))","v":60},{"$f":"IF(OR(F7=4,F7=8),Calculator!$D$9,IF(AND(OR(F7=1,F7=5,F7=9,F7=10),Input!$D$16=\"Joint Life\"),Calculator!$D$9,\"NA\"))","v":60},{"$f":"IF(OR(G7=4,G7=8),Calculator!$D$9,IF(AND(OR(G7=1,G7=5,G7=9,G7=10),Input!$D$16=\"Joint Life\"),Calculator!$D$9,\"NA\"))","v":"NA"},{"$f":"IF(OR(H7=4,H7=8),Calculator!$D$9,IF(AND(OR(H7=1,H7=5,H7=9,H7=10),Input!$D$16=\"Joint Life\"),Calculator!$D$9,\"NA\"))","v":"NA"},{"$f":"IF(OR(I7=4,I7=8),Calculator!$D$9,IF(AND(OR(I7=1,I7=5,I7=9,I7=10),Input!$D$16=\"Joint Life\"),Calculator!$D$9,\"NA\"))","v":60},{"$f":"IF(OR(J7=4,J7=8),Calculator!$D$9,IF(AND(OR(J7=1,J7=5,J7=9,J7=10),Input!$D$16=\"Joint Life\"),Calculator!$D$9,\"NA\"))","v":60},null,{"$f":"IF(Output!G14=\"QROPs\",55,IF(Input!G11=\"Yes\",45,IF(Annuity_Option<>6,0,45)))","v":0},{"$f":"IF(AND(Input!G11=\"No\",Annuity_Option=5),100,IF(OR(Annuity_Option=6,Annuity_Option=7),65,IF(Annuity_Option=9,75,90)))","v":90},{"$f":"IF(SUM(N$2:N3)>0,0,IF(ISERROR(O4),0,IF(O4=0,0,1)))","v":0},{"$f":"IF(JointLife_Ind=1,IF($B$4<$L$4,3,IF($B$4>$M$4,4,0)),0)","v":0},2,{"$f":"\"Maximum entry age for primary annuitant is \"&M3","v":"Maximum entry age for primary annuitant is 90"},null,null,"Option 2 - Annuity Certain for a specified period and thereafter for life",2,null,"Semi-Annual",2,0.98,2,6000,"Premium",1,null,{"$f":"AE3+1","v":2},"Option 2 - Annuity Certain for a specified period and thereafter for life",null,1,"Option 1 - Life Annuity","Increasing",0.03,null,null,1,null,1,"'Single Life'!$B$9:$F$110",null,5,"'Single Life'!$B$116:$F$217",null,{"$f":"IF($B$12=0,0,VLOOKUP(Age_1,'Joint Life Factors'!$A$9:$L$12,5,TRUE))","v":-0.11},{"$f":"IF(JointLife_Ind=0,VLOOKUP(IF(AND(Gender=2,Annuity_Option<>6,Annuity_Option<>7),MAX(Age_1-3,0),Age_1),IF(AND(Gender=2,OR(Annuity_Option=6,Annuity_Option=7)),INDIRECT($AR4),INDIRECT($AQ4)),$AS4,0),VLOOKUP(IF(Age_1=Age_2,IF(OR(Gender=2,$B$6=2),MAX(Age_1-3,0),Age_1),IF(Age_1<Age_2,IF(Gender=2,MAX(Age_1-3,0),Age_1),IF($B$6=2,MAX(Age_2-3,0),Age_2))),INDIRECT($AQ4),$AS4,0))","v":6172},{"$f":"IF(JointLife_Ind=0,VLOOKUP(IF(AND(Gender=2,Annuity_Option<>6,Annuity_Option<>7),MAX(Age_1-3,0),Age_1),IF(AND(Gender=2,OR(Annuity_Option=6,Annuity_Option=7)),INDIRECT($AU4),INDIRECT($AT4)),$AS4,0),VLOOKUP(IF(Age_1=Age_2,IF(OR(Gender=2,$B$6=2),MAX(Age_1-3,0),Age_1),IF(Age_1<Age_2,IF(Gender=2,MAX(Age_1-3,0),Age_1),IF($B$6=2,MAX(Age_2-3,0),Age_2))),INDIRECT($AT4),$AS4,0))","v":6421},{"$f":"IF(Request=2,Annuity_Input,((AW4*MIN(200000,Premium_Input)/100000)+AX4*IF(Premium_Input>200000,(Premium_Input-200000)/100000,0))*IF(JointLife_Ind=1,(1+AV4),1)*(VLOOKUP(Payout_Mode,'Modal Factors'!$C$4:$D$7,2,0))*IF(OR(Input!$D$22=\"Yes\",Input!$D$23=\"Yes\"),Bonus_SP,1)/VLOOKUP(Payout_Mode,$X$3:$Z$6,3,0))","v":292423.56199999998},null,null,null,{"$f":"(((($L$14*VLOOKUP(Payout_Mode,$X$3:$Z$6,3,0))/(VLOOKUP(Payout_Mode,'Modal Factors'!$C$4:$D$7,2,0))/(IF(OR(Input!$D$22=\"Yes\",Input!$D$23=\"Yes\"),Bonus_SP,1)))/IF(JointLife_Ind=0,1,(1+AV4)))-(200000*AW4)/100000)/(AX4/100000)+200000","v":212619.35596105357},{"$f":"(((($L$14*VLOOKUP(Payout_Mode,$X$3:$Z$6,3,0))/(VLOOKUP(Payout_Mode,'Modal Factors'!$C$4:$D$7,2,0))/(IF(OR(Input!$D$22=\"Yes\",Input!$D$23=\"Yes\"),Bonus_SP,1)))/IF(JointLife_Ind=0,1,(1+AV4)))/(AW4/100000))","v":213128.46478061},{"$f":"MAX(150000,0,IF(BC4>200000,BC4,BD4))","v":212619.35596105357},{"$f":"MAX((AW4*150000/100000)*IF(JointLife_Ind=1,(1+AV4),1)*(VLOOKUP(Payout_Mode,'Modal Factors'!$C$4:$D$7,2,0))*IF(OR(Input!$D$22=\"Yes\",Input!$D$23=\"Yes\"),Bonus_SP,1)/VLOOKUP(Payout_Mode,$X$3:$Z$6,3,0), IF(Payout_Mode=1,12000,IF(Payout_Mode=2,6000,IF(Payout_Mode=3,3000,1000))))","v":12000},null,{"$f":"IF(OR(Age_1>90,AND(Calculator!$E$22=\"Joint Life\", Age_2>90)),\"Maximum entry age is 90 years\",\"\")","v":""},{"$f":"IF(Request=2, IF(Annuity_Input<Check!BF4,\"Minimum Annuity amount should be \"&ROUNDUP(BF4,0),\"\"),\"\")","v":""},"",{"$f":"IF(AND(OR($AN4=8,$AN4=9),AO4>10),\"Deferment Period not allowed\",IF(AND($AN4=10,AO4>11),\"Deferment Period not allowed\",\"\"))","v":""}]
["Gender - Annuitant 1",{"$f":"IF(OR(Input!$H$7=\"Male\",Input!$H$7=\"Transgender\"),1,2)","v":1},null,null,null,null,null,null,null,null,null,null,null,{"$f":"IF(SUM(N$2:N4)>0,0,IF(ISERROR(O5),0,IF(O5=0,0,1)))","v":0},{"$f":"IF(Request=2,IF(Annuity_Input<L11,5,0),0)","v":0},3,{"$f":"IF(Output!G14=\"QROPs\",\"Minimum entry age for QROPs is \"&L4,\"Minimum entry age for primary annuitant is \"&L4)","v":"Minimum entry age for primary annuitant is 0"},null,null,"Option 3 - Life Annuity with return of Balance of Purchase Price",3,null,"Quarterly",3,0.97,4,3000,null,null,null,{"$f":"AE4+1","v":3},"Option 3 - Life Annuity with return of Balance of Purchase Price",null,1,"Option 1 - Life Annuity","Increasing",0.05,null,null,1,null,1,"'Single Life'!$B$9:$G$110",null,6,"'Single Life'!$B$116:$G$217",null,{"$f":"IF($B$12=0,0,VLOOKUP(Age_1,'Joint Life Factors'!$A$9:$L$12,6,TRUE))","v":-0.12},{"$f":"IF(JointLife_Ind=0,VLOOKUP(IF(AND(Gender=2,Annuity_Option<>6,Annuity_Option<>7),MAX(Age_1-3,0),Age_1),IF(AND(Gender=2,OR(Annuity_Option=6,Annuity_Option=7)),INDIRECT($AR5),INDIRECT($AQ5)),$AS5,0),VLOOKUP(IF(Age_1=Age_2,IF(OR(Gender=2,$B$6=2),MAX(Age_1-3,0),Age_1),IF(Age_1<Age_2,IF(Gender=2,MAX(Age_1-3,0),Age_1),IF($B$6=2,MAX(Age_2-3,0),Age_2))),INDIRECT($AQ5),$AS5,0))","v":5333},{"$f":"IF(JointLife_Ind=0,VLOOKUP(IF(AND(Gender=2,Annuity_Option<>6,Annuity_Option<>7),MAX(Age_1-3,0),Age_1),IF(AND(Gender=2,OR(Annuity_Option=6,Annuity_Option=7)),INDIRECT($AU5),INDIRECT($AT5)),$AS5,0),VLOOKUP(IF(Age_1=Age_2,IF(OR(Gender=2,$B$6=2),MAX(Age_1-3,0),Age_1),IF(Age_1<Age_2,IF(Gender=2,MAX(Age_1-3,0),Age_1),IF($B$6=2,MAX(Age_2-3,0),Age_2))),INDIRECT($AT5),$AS5,0))","v":5549},{"$f":"IF(Request=2,Annuity_Input,((AW5*MIN(200000,Premium_Input)/100000)+AX5*IF(Premium_Input>200000,(Premium_Input-200000)/100000,0))*IF(JointLife_Ind=1,(1+AV5),1)*(VLOOKUP(Payout_Mode,'Modal Factors'!$C$4:$D$7,2,0))*IF(OR(Input!$D$22=\"Yes\",Input!$D$23=\"Yes\"),Bonus_SP,1)/VLOOKUP(Payout_Mode,$X$3:$Z$6,3,0))","v":249870.23599999998},null,null,null,{"$f":"(((($L$14*VLOOKUP(Payout_Mode,$X$3:$Z$6,3,0))/(VLOOKUP(Payout_Mode,'Modal Factors'!$C$4:$D$7,2,0))/(IF(OR(Input!$D$22=\"Yes\",Input!$D$23=\"Yes\"),Bonus_SP,1)))/IF(JointLife_Ind=0,1,(1+AV5)))-(200000*AW5)/100000)/(AX5/100000)+200000","v":247535.94163507619},{"$f":"(((($L$14*VLOOKUP(Payout_Mode,$X$3:$Z$6,3,0))/(VLOOKUP(Payout_Mode,'Modal Factors'!$C$4:$D$7,2,0))/(IF(OR(Input!$D$22=\"Yes\",Input!$D$23=\"Yes\"),Bonus_SP,1)))/IF(JointLife_Ind=0,1,(1+AV5)))/(AW5/100000))","v":249461.26760416981},{"$f":"MAX(150000,0,IF(BC5>200000,BC5,BD5))","v":247535.94163507619},{"$f":"MAX((AW5*150000/100000)*IF(JointLife_Ind=1,(1+AV5),1)*(VLOOKUP(Payout_Mode,'Modal Factors'!$C$4:$D$7,2,0))*IF(OR(Input!$D$22=\"Yes\",Input!$D$23=\"Yes\"),Bonus_SP,1)/VLOOKUP(Payout_Mode,$X$3:$Z$6,3,0), IF(Payout_Mode=1,12000,IF(Payout_Mode=2,6000,IF(Payout_Mode=3,3000,1000))))","v":12000},null,{"$f":"IF(OR(Age_1>90,AND(Calculator!$E$22=\"Joint Life\", Age_2>90)),\"Maximum entry age is 90 years\",\"\")","v":""},{"$f":"IF(Request=2, IF(Annuity_Input<Check!BF5,\"Minimum Annuity amount should be \"&ROUNDUP(BF5,0),\"\"),\"\")","v":""},"",""]
["Gender - Annuitant 2",{"$f":"IF(OR(Annuity_Option=4,Annuity_Option=8,AND(OR(Annuity_Option=1,Annuity_Option=5,Annuity_Option=9,Annuity_Option=10),Input!D16=\"Joint Life\")),IF(OR(Input!$H$8=\"Male\",Input!$H$8=\"Transgender\"),1,2),\"NA\")","v":1},{"$f":"IF(OR(C7=4,C7=8,AND(OR(C7=1,C7=5,C7=9,C7=10),Input!$D$16=\"Joint Life\")),IF(OR(Input!$H$8=\"Male\",Input!$H$8=\"Transgender\"),1,2),\"NA\")","v":"NA"},{"$f":"IF(OR(D7=4,D7=8,AND(OR(D7=1,D7=5,D7=9,D7=10),Input!$D$16=\"Joint Life\")),IF(OR(Input!$H$8=\"Male\",Input!$H$8=\"Transgender\"),1,2),\"NA\")","v":"NA"},{"$f":"IF(OR(E7=4,E7=8,AND(OR(E7=1,E7=5,E7=9,E7=10),Input!$D$16=\"Joint Life\")),IF(OR(Input!$H$8=\"Male\",Input!$H$8=\"Transgender\"),1,2),\"NA\")","v":1},{"$f":"IF(OR(F7=4,F7=8,AND(OR(F7=1,F7=5,F7=9,F7=10),Input!$D$16=\"Joint Life\")),IF(OR(Input!$H$8=\"Male\",Input!$H$8=\"Transgender\"),1,2),\"NA\")","v":1},{"$f":"IF(OR(G7=4,G7=8,AND(OR(G7=1,G7=5,G7=9,G7=10),Input!$D$16=\"Joint Life\")),IF(OR(Input!$H$8=\"Male\",Input!$H$8=\"Transgender\"),1,2),\"NA\")","v":"NA"},{"$f":"IF(OR(H7=4,H7=8,AND(OR(H7=1,H7=5,H7=9,H7=10),Input!$D$16=\"Joint Life\")),IF(OR(Input!$H$8=\"Male\",Input!$H$8=\"Transgender\"),1,2),\"NA\")","v":"NA"},{"$f":"IF(OR(I7=4,I7=8,AND(OR(I7=1,I7=5,I7=9,I7=10),Input!$D$16=\"Joint Life\")),IF(OR(Input!$H$8=\"Male\",Input!$H$8=\"Transgender\"),1,2),\"NA\")","v":1},{"$f":"IF(OR(J7=4,J7=8,AND(OR(J7=1,J7=5,J7=9,J7=10),Input!$D$16=\"Joint Life\")),IF(OR(Input!$H$8=\"Male\",Input!$H$8=\"Transgender\"),1,2),\"NA\")","v":1},null,null,null,{"$f":"IF(SUM(N$2:N5)>0,0,IF(ISERROR(O6),0,IF(O6=0,0,1)))","v":0},{"$f":"IF(Request=1,IF($B$10<$L$10,6,0),0)","v":0},4,{"$f":"\"Maximum entry age for secondary annuitant is \"&M4","v":"Maximum entry age for secondary annuitant is 90"},null,null,"Option 4 - Life Annuity with 50% Annuity payable to Secondary Annuitant on death of Primary Annuitant",4,null,"Monthly",4,0.96,12,1000,null,null,null,4,"Option 4 - Life Annuity with 50% Annuity payable to Secondary Annuitant on death of Primary Annuitant",null,2,"Option 2 - Annuity Certain for a specified period and thereafter for life",null,null,5,null,1,null,1,"'Single Life'!$B$9:$H$110",null,7,"'Single Life'!$B$116:$H$217",null,{"$f":"IF($C$12=0,0,VLOOKUP(Age_1,'Joint Life Factors'!$A$9:$L$12,MATCH(1,'Joint Life Factors'!$D$5:$L$5,0)+3,TRUE))","v":0},{"$f":"IF($C$12=0,VLOOKUP(IF(AND(Gender=2,$C$7<>6,$C$7<>7),MAX(Age_1-3,0),Age_1),IF(AND(Gender=2,OR($C$7=6,$C$7=7)),INDIRECT($AR6),INDIRECT($AQ6)),$AS6,0),VLOOKUP(IF(Age_1=$C$4,IF(OR(Gender=2,$C$6=2),MAX(Age_1-3,0),Age_1),IF(Age_1<Age_2,IF(Gender=2,MAX(Age_1-3,0),Age_1),IF($C$6=2,MAX(Age_2-3,0),Age_2))),INDIRECT($AQ6),$AS6,0))","v":8060},{"$f":"IF($C$12=0,VLOOKUP(IF(AND(Gender=2,$C$7<>6,$C$7<>7),MAX(Age_1-3,0),Age_1),IF(AND(Gender=2,OR($C$7=6,$C$7=7)),INDIRECT($AU6),INDIRECT($AT6)),$AS6,0),VLOOKUP(IF(Age_1=$C$4,IF(OR(Gender=2,$C$6=2),MAX(Age_1-3,0),Age_1),IF(Age_1<Age_2,IF(Gender=2,MAX(Age_1-3,0),Age_1),IF($C$6=2,MAX(Age_2-3,0),Age_2))),INDIRECT($AT6),$AS6,0))","v":8385},{"$f":"IF(Request=2,Annuity_Input,((AW6*MIN(200000,Premium_Input)/100000)+AX6*IF(Premium_Input>200000,(Premium_Input-200000)/100000,0))*IF(JointLife_Ind=1,(1+AV6),1)*(VLOOKUP(Payout_Mode,'Modal Factors'!$C$4:$D$7,2,0))*IF(OR(Input!$D$22=\"Yes\",Input!$D$23=\"Yes\"),Bonus_SP,1)/VLOOKUP(Payout_Mode,$X$3:$Z$6,3,0))","v":429064.99999999994},{"$f":"IF(Request=1,Premium_Input,((((AY6*VLOOKUP(Payout_Mode,$X$3:$Z$6,3,0))/(VLOOKUP(Payout_Mode,'Modal Factors'!$C$4:$D$7,2,0))/(IF(OR(Input!$D$22=\"Yes\",Input!$D$23=\"Yes\"),Bonus_SP,1)))/IF(JointLife_Ind=0,1,(1+$AV6)))-(200000*AW6)/100000)/(AX6/100000)+200000)","v":5000000},{"$f":"IF(Request=1,Premium_Input,((((AY6*VLOOKUP(Payout_Mode,$X$3:$Z$6,3,0))/(VLOOKUP(Payout_Mode,'Modal Factors'!$C$4:$D$7,2,0))/(IF(OR(Input!$D$22=\"Yes\",Input!$D$23=\"Yes\"),Bonus_SP,1)))/IF(JointLife_Ind=0,1,(1+$AV6)))/(AW6/100000)))","v":5000000},{"$f":"IF(AZ6>200000,AZ6,BA6)","v":5000000},{"$f":"(((($L$14*VLOOKUP(Payout_Mode,$X$3:$Z$6,3,0))/(VLOOKUP(Payout_Mode,'Modal Factors'!$C$4:$D$7,2,0))/(IF(OR(Input!$D$22=\"Yes\",Input!$D$23=\"Yes\"),Bonus_SP,1)))/IF(JointLife_Ind=0,1,(1+AV6)))-(200000*AW6)/100000)/(AX6/100000)+200000","v":147374.08554765332},{"$f":"(((($L$14*VLOOKUP(Payout_Mode,$X$3:$Z$6,3,0))/(VLOOKUP(Payout_Mode,'Modal Factors'!$C$4:$D$7,2,0))/(IF(OR(Input!$D$22=\"Yes\",Input!$D$23=\"Yes\"),Bonus_SP,1)))/IF(JointLife_Ind=0,1,(1+AV6)))/(AW6/100000))","v":145252.07286812321},150000,{"$f":"MAX((AW6*150000/100000)*IF(JointLife_Ind=1,(1+AV6),1)*(VLOOKUP(Payout_Mode,'Modal Factors'!$C$4:$D$7,2,0))*IF(OR(Input!$D$22=\"Yes\",Input!$D$23=\"Yes\"),Bonus_SP,1)/VLOOKUP(Payout_Mode,$X$3:$Z$6,3,0), IF(Payout_Mode=1,12000,IF(Payout_Mode=2,6000,IF(Payout_Mode=3,3000,1000))))","v":12392.249999999998},null,{"$f":"IF(OR(Age_1>90,AND(Calculator!$E$22=\"Joint Life\", Age_2>90)),\"Maximum entry age is 90 years\",\"\")","v":""},{"$f":"IF(Request=2, IF(Annuity_Input<Check!BF6,\"Minimum Annuity amount should be \"&ROUNDUP(BF6,0),\"\"),\"\")","v":""},"",""]
{"$rows_left_out":70}
{"sheet":"Input","index":2,"n_rows":41,"n_cols":10,"rows_kept":41,"cut":false,"hidden":true,"merged":[[2,2,2,7],[1,2,1,7],[3,2,3,7]]}
[]
[null,null," Aditya Birla Sun Life Insurance"]
[null,null,{"$f":"IF(Check!P2>=1,\"ERROR - \"&Check!Q2,\"ABSLI Guaranteed Annuity Plus\")","v":"ABSLI Guaranteed Annuity Plus"}]
[null,null,"Your Policy Illustration"]
[]
[]
{"$rows_left_out":36}
{"sheet":"Please read","index":3,"n_rows":8,"n_cols":6,"rows_kept":8,"cut":false,"hidden":true,"merged":[]}
["Date","UIN Version","Sheet","Cell","Description","Color"]
["2025-05-08","V15","Single Pay","Highlighted cells updated","Updated annuity rates for Single Pay"]
["2025-05-08","V15","Limited Pay","Highlighted cells updated","Updated specific annuity rates for Limited Pay "]
["2025-05-08","V15","Input","D10","Updated UIN to V15"]
["2025-05-08","V15","Output","C9","Updated UIN to V15"]
["2025-05-08","V15","Surrender Factors","C:K","Updated SSF factors"]
{"$rows_left_out":3}
{"sheet":"Output","index":4,"n_rows":147,"n_cols":9,"rows_kept":147,"cut":false,"hidden":true,"merged":[[33,2,33,3],[37,3,37,7],[130,1,130,13],[144,1,144,13],[1,1,1,8],[2,1,2,8],[3,1,3,8],[4,1,4,8],[30,1,30,6],[32,2,32,3],[34,2,34,3],[7,1,7,6]]}
[]
[null,"                             Aditya Birla Sun Life Insurance"]
[null,"                             ABSLI Guaranteed Annuity Plus"]
[null,"A Non Linked Non Participating Single Premium General Annuity Plan"]
[null,"                                Your Benefit Illustration"]
[null,null,null,null,"This shall form a part of the policy contract"]
{"$rows_left_out":142}
{"sheet":"Single Life","index":5,"n_rows":217,"n_cols":44,"rows_kept":217,"cut":false,"hidden":true,"merged":[[6,1,7,2],[6,33,7,33],[6,38,7,38],[113,1,114,2],[113,33,114,33],[113,38,114,38]]}
["ABSLI Guaranteed Annuity Plus"]
[]
["Single Life Annuity Rate Table"]
["(Rates are per 1 Lakh of Purchase Price)"]
[]
[null,"Rate1 -->",null,null,null,null,null,null,null,null,null,null,null,null,null,null,null,null,null,null,null,null,null,null,null,null,null,null,null,null,null,null,null,"Rate1 -->",null,null,null,null,"Rate1 -->"]
{"$rows_left_out":212}
{"sheet":"Limited Pay","index":6,"n_rows":167,"n_cols":75,"rows_kept":167,"cut":false,"hidden":true,"merged":[[88,66,89,67],[6,1,7,2],[6,16,7,17],[6,30,7,31],[6,43,7,44],[6,55,7,56],[6,66,7,67],[88,1,89,2],[88,16,89,17],[88,30,89,31],[88,43,89,44],[88,55,89,56]]}
["ABSLI Guaranteed Annuity Plus"]
[]
["Single Life Annuity Rate Table for 5 Pay",null,null,null,null,null,null,null,null,null,null,null,null,null,null,null,"Single Life Annuity Rate Table for 6 Pay",null,null,null,null,null,null,null,null,null,null,null,null,null,"Single Life Annuity Rate Table for 7 Pay",null,null,null,null,null,null,null,null,null,null,null,null,"Single Life Annuity Rate Table for 8 Pay",null,null,null,null,null,null,null,null,null,null,null,"Single Life Annuity Rate Table for 9 Pay",null,null,null,null,null,null,null,null,null,null,"Single Life Annuity Rate Table for 10 Pay"]
["(Rates are per 1 Lakh of Premium)",null,null,null,null,null,null,null,null,null,null,null,null,null,null,null,"(Rates are per 1 Lakh of Premium)",null,null,null,null,null,null,null,null,null,null,null,null,null,"(Rates are per 1 Lakh of Premium)",null,null,null,null,null,null,null,null,null,null,null,null,"(Rates are per 1 Lakh of Premium)",null,null,null,null,null,null,null,null,null,null,null,"(Rates are per 1 Lakh of Premium)",null,null,null,null,null,null,null,null,null,null,"(Rates are per 1 Lakh of Premium)"]
[]
[null,"Rate1 -->",null,null,null,null,null,null,null,null,null,null,null,null,null,null,"Rate1 -->",null,null,null,null,null,null,null,null,null,null,null,null,null,"Rate1 -->",null,null,null,null,null,null,null,null,null,null,null,null,"Rate1 -->",null,null,null,null,null,null,null,null,null,null,null,"Rate1 -->",null,null,null,null,null,null,null,null,null,null,"Rate1 -->"]
{"$rows_left_out":162}
{"sheet":"Joint Life Factors","index":7,"n_rows":12,"n_cols":12,"rows_kept":12,"cut":false,"hidden":true,"merged":[[5,1,7,1]]}
["ABSLI Guaranteed Annuity Plus"]
[]
["Joint Life Factors"]
[{"$f":"COLUMN()","v":1},{"$f":"COLUMN()","v":2},{"$f":"COLUMN()","v":3},{"$f":"COLUMN()","v":4},{"$f":"COLUMN()","v":5},{"$f":"COLUMN()","v":6},{"$f":"COLUMN()","v":7},{"$f":"COLUMN()","v":8},{"$f":"COLUMN()","v":9},{"$f":"COLUMN()","v":10},{"$f":"COLUMN()","v":11},{"$f":"COLUMN()","v":12}]
[null,null,null,{"$f":"Check!AP3","v":1},{"$f":"Check!AP4","v":1},{"$f":"Check!AP5","v":1},{"$f":"Check!AP13","v":1},{"$f":"IF(AND(Annuity_Option=10,JointLife_Ind=1),1,Check!AP14)","v":1},{"$f":"Check!AP15","v":1},{"$f":"Check!AP16","v":1},{"$f":"Check!AP19","v":1},{"$f":"Check!AP20","v":1}]
[null,"Age Band (Primary Annuitant)","Annuity Option -->",1,1,1,4,5,5,5,8,9]
{"$rows_left_out":7}
{"sheet":"Modal Factors","index":8,"n_rows":7,"n_cols":5,"rows_kept":7,"cut":false,"hidden":true,"merged":[]}
[]
[]
[null,null,"Payout Frequency","Factor"]
[null,"Annual",1,1,12]
[null,"Semi-Annual",2,0.98,6]
[null,"Quarterly",3,0.97,3]
{"$rows_left_out":2}
{"sheet":"Surrender Factors","index":9,"n_rows":131,"n_cols":18,"rows_kept":131,"cut":false,"hidden":true,"merged":[[8,14,8,15]]}
["ABSLI Guaranteed Annuity Plus"]
[]
["Special Surrender Factors"]
["SSF1 and SSF2 Factors are applicable based on attained age"]
["For Joint Life - Minimum of the ages of Primary and Secondary Annuitant to be considered; Incase of death of one life, age of the surviving Annuitant to be considered"]
["For Annuity Option 9, Attained Age as at the end of Deferment Period to be considered if the Policy is surrendered during the Deferment Period"]
{"$rows_left_out":125}